BDBM86550 Piperidin-1-ium analog, 2
SMILES COC(=O)c1occc1C[NH+]1CCC(CC1)c1c[nH]c2ccccc12
InChI Key InChIKey=MPZRVJWYRILMES-UHFFFAOYSA-O
Data  3 KI
  Tab Delimited (TSV)   2D SDfile   Computed 3D by Vconf -m prep SDfile
Find this compound or compounds like it in BindingDB:
Activity Spreadsheet -- Enzyme Inhibition Constant Data from BindingDB
Found 1 hit for monomerid = 86550
TargetBeta-2 adrenergic receptor(Homo sapiens (Human))
University of California San Francisco
LigandPNGBDBM86550(Piperidin-1-ium analog, 2)
Affinity DataKi: >1.00E+4nM ΔG°: >-6.75kcal/molepH: 7.4 T: 2°C. Assay description: Affinities for D3-dopaminergic, D2-dopaminergic and beta2-adrenergic receptors were determined by radioligand competition binding at the National Ins...
In DepthDetails ArticlePubMed